| running 1 test | |
| test $DIR/unparseable-doc-test.rs - foo (line 7) ... FAILED | |
| failures: | |
| ---- $DIR/unparseable-doc-test.rs - foo (line 7) stdout ---- | |
| error[E0765]: unterminated double quote string | |
| --> $DIR/unparseable-doc-test.rs:9:1 | |
| | | |
| LL | "unterminated | |
| | ^^^^^^^^^^^^^ | |
| error: aborting due to 1 previous error | |
| For more information about this error, try `rustc --explain E0765`. | |
| Couldn't compile the test. | |
| failures: | |
| $DIR/unparseable-doc-test.rs - foo (line 7) | |
| test result: FAILED. 0 passed; 1 failed; 0 ignored; 0 measured; 0 filtered out; finished in $TIME | |